Office,State,Committee KPID,Committee Title,Lastname,Firstname,Prefix,Suffix,Middlename,Fullname,Firstinit,Midinit,Lastinit,Displayname1,Displayname2,Preflname,Busadd,Busadd2,Buscity,Busemail,Busfax,Busph,Busstate,Buszip,County,District,Email,Enddate,Endnote,Firstterm,Hmemail,Hmfax,Hmmailadd,Hmmailadd2,Hmmailcity,Hmmailstate,Hmmailzip,Hmph,Hmphysadd,Hmphysadd2,Hmphyscity,Hmphysstate,Hmphyszip,Occupation,Oppchterm,Offadd,Offadd2,Offcity,Offfax,Officenum,Offph,Offstate,Offzip,Party,Prefemail,Preffname,Seatnum,Spousename,Url,Chair,Vicechair,Rmmem
Representative,KS,ctte_h_fed_st_1,Federal and State Affairs,Arnberger,Tory,Ms,,Marie,Tory Marie Arnberger,T,M,A,"Arnberger, Tory Marie",,Arnberger,,,,,,,,,Barton,112,ToryMarie.Arnberger@house.ks.gov,,,,tmarnberger@gmail.com,,PO Box 103,,Great Bend,KS,67530,620-603-8967,1212 Bradley,,Great Bend,KS,67530,"Human Resources Director, Pryor Automatic",,,,,,512-N,785 296-7363,,,Republican,,Tory,45,Justin Blew,,,Yes,
Representative,KS,ctte_h_fed_st_1,Federal and State Affairs,Awerkamp,Francis,Mr,,,Francis Awerkamp,F,,A,"Awerkamp, Francis",,Awerkamp,,,,,,,,,Pottawatomie,61,francis.awerkamp@house.ks.gov,,,,fawerkamp@gmail.com,,807 W. Linn St.,,St. Marys,KS,66536,785-844-2131,807 W. Linn St.,,St. Marys,KS,66536,Business owner,,,,,,187-N,785 296-6989,,,Republican,,Francis,106,Shannon,,,,
Representative,KS,ctte_h_fed_st_1,Federal and State Affairs,Barker,John,Mr,,,John Barker,,,,"Barker, John",,Barker,,,,,,,,,Dickinson,70,john.barker@house.ks.gov,,,2013,johnbarker2012@yahoo.com,,103 Wassinger Ave.,,Abilene,KS,67410,785 479-7519,103 Wassinger Ave.,,Abilene,KS,67410,Retired Judge,,,,,,285-N,785 296-7674,,,Republican,,John,10,April,,Yes,,
Representative,KS,ctte_h_fed_st_1,Federal and State Affairs,Carpenter,Blake,Mr,,,Blake Carpenter,B,,C,"Carpenter, Blake",,Carpenter,,,,,,,,,Sedgwick,81,blake.carpenter@house.ks.gov,,Resigned 1/10/2022 for temporary military service leave; Replaced by Leah Howell; resworn 5/11/2022.,2015,blake@carpenterforkansas.com,,1300 E Meadowlark Blvd Apt 2203,,Derby,KS,67037,316-202-5385,1300 E Meadowlark Blvd Apt 2203,,Derby,KS,67037,Contractor,,,,,,149-S,785-296-7567,,,Republican,,Blake,98,Tyleigha,,,,
Representative,KS,ctte_h_fed_st_1,Federal and State Affairs,Clayton,Stephanie,Mrs,,,Stephanie Clayton,,,,"Clayton, Stephanie",,Clayton,,,,,,,,,Johnson,19,stephanie.clayton@house.ks.gov,,Rep. Clayton changed party affiliation from Republican to Democrat on 12/19/2018,2013,stephaniesawyerclayton@gmail.com,,9825 Woodson Dr.,,Overland Park,KS,66207,913 205-4970,9825 Woodson Dr.,,Overland Park,KS,66207,Social Media Consultant,,,,,,451-S,785 296-7548,,,Democrat,,Stephanie,14,Benjamin,,,,
Representative,KS,ctte_h_fed_st_1,Federal and State Affairs,Eplee,John,Mr,,R.,John Eplee,J,R,E,"Eplee, John",,Eplee,,,,jeplee@atchhosp.org,,,,,Atchison,63,John.Eplee@house.ks.gov,,,,jeplee@atchhosp.org,,163 Deer Run,,Atchison,KS,66002,913-367-5910,163 Deer Run,,Atchison,KS,66002,Family Physician,,,,,,352-S,785 296-8621,,,Republican,,John,61,Deborah,,,,
Representative,KS,ctte_h_fed_st_1,Federal and State Affairs,Garber,Randy,Mr,,,Randy Garber,R,,G,"Garber, Randy",,Garber,,,,,,,,,Nemaha,62,randy.garber@house.ks.gov,,,2011,randygarber@ymail.com,785 284-2472,2424 Timberlane Terr.,,Sabetha,KS,66534,785-285-1238,2424 Timberlane Terr,,Sabetha,KS,66534,Retired Navy/Construction Worker,,,,,,459-W,785 296-7665,,,Republican,,Randy,110,Kay,,,,
Representative,KS,ctte_h_fed_st_1,Federal and State Affairs,Haswood,Christina,Ms,,,Christina Haswood,C,,H,"Haswood, Christina",,Haswood,,,,,,,,,Douglas,10,christina.haswood@house.ks.gov,,,,christina@haswoodforkansas.com,,PO Box 3083,,Lawrence,KS,66046,785 380-8992,1942 Stewart Ave.,Apt. F15,Lawrence,KS,66046,Public Health Worker,,,,,,54-A,785 296-7652,,,Democrat,,Christina,32,,,,,
Representative,KS,ctte_h_fed_st_1,Federal and State Affairs,Henderson,Broderick,,,,Broderick Henderson,,,,"Henderson, Broderick",,,,,,,,913-573-5328,,,Wyandotte,35,broderick.henderson@house.ks.gov,,,1995,bhenderson@wycokck.org,,2710 North 8thStreet,,Kansas City,KS,66101,913-342-2614,2710 North 8thStreet,,Kansas City,KS,66101,Parking Controller Office,,,,,,451-S,785 296-7697,,,Democrat,,,55,,,,,
Representative,KS,ctte_h_fed_st_1,Federal and State Affairs,Highberger,"Dennis ""Boog""",,,,"Dennis ""Boog"" Highberger",D,,H,"Highberger, Dennis ""Boog""",,Highberger,,,,boog@highbergerananda.com,888-392-7697,785-841-3313 ,,,Douglas,46,dennis.boog.highberger@house.ks.gov,,,2015,mrboog@att.net,,1024 New York,,Lawrence,KS,66044,,1024 New York,,Lawrence,KS,66044,Attorney,,,,,,174-S,785-296-7122,,,Democrat,,,36,,,,,
Representative,KS,ctte_h_fed_st_1,Federal and State Affairs,Houser,Michael,,,,Michael Houser,,,,"Houser, Michael",,Houser,,,,,,,,,Cherokee,1,michael.houser@house.ks.gov,,,2013,mhouser_2010@yahoo.com,,6891 SW 10th ,,Columbus,KS,66725,620 704-3817,6891 SW 10th ,,Columbus,KS,66725,Construction Estimator,,,,,,179-N,785 296-7679,,,Republican,,,112,,,,,
Representative,KS,ctte_h_fed_st_1,Federal and State Affairs,Howe,Steven,Mr,,K.,Steven K. Howe,S,K,H,"Howe, Steven",,,,,,,,,,,Saline,71,steven.howe@house.ks.gov,,,,howeKS71@gmail.com,,2202 Melrose,,Salina,KS,67401,785 643-1606,2202 Melrose Lane,,Salina,KS,67401,,,,,,,167-W,785 296-7642,,,Republican,,,84,,,,,
Representative,KS,ctte_h_fed_st_1,Federal and State Affairs,Hoye,Jo Ella,Mrs,,,Jo Ella Hoye,J,,H,"Hoye, Jo Ella",,Hoye,,,,,,,,,Johnson,17,JoElla.Hoye@house.ks.gov,,,,joellaforkansas@gmail.com,,8517 Alden Lane,,Lenexa,KS,66215,816 248-2601,8517 Alden Lane,,Lenexa,KS,66215,,,,,,,54-S,785 296-7331,,,Democrat,,Jo Ella,28,Brian,,,,
Representative,KS,ctte_h_fed_st_1,Federal and State Affairs,Miller,Vic,Mr,,,Vic Miller,V,,M,"Miller, Vic",,,,,,,,785-233-9950,,,Shawnee,58,Vic.Miller@house.ks.gov,,,,victorwmiller@aol.com,,1174 SW Fillmore,,Topeka,KS,66604,785-224-3375,1174 SW Fillmore,,Topeka,KS,66604,Retired,,,,,,50-S,785 296-7365,,,Democrat,,Vic,76,,,,,
Representative,KS,ctte_h_fed_st_1,Federal and State Affairs,Moser,Lisa,Mrs,,M.,Lisa Moser,L,M,M,"Moser, Lisa",,Moser,,,,moserranch@moserranch.com,,,,,Pottawatomie,106,lisa.moser@house.ks.gov,,,,lisa.moser@house.ks.gov,,3063 26th Rd.,,Wheaton,KS,66521,785 456-3876,3063 26th Rd.,,Wheaton,KS,66521,Rancher,,,,,,268-W,785 296-7637,,,Republican,,Lisa,100,Harry Moser,,,,
Representative,KS,ctte_h_fed_st_1,Federal and State Affairs,Penn,Patrick,Mr,,,Patrick Penn,P,,P,"Penn, Patrick",,Penn,,,,,,,,,Sedgwick,85,patrick.penn@house.ks.gov,,,,Pat@patrickpenn.com,,2507 N. Lindberg St.,,Wichita,KS,67226,316-518-0168,2507 N. Lindberg St.,,Wichita,KS,67226,,,,,,,512-N,785 296-7473,,,Republican,,Patrick,44,Talia Penn,,,,
Representative,KS,ctte_h_fed_st_1,Federal and State Affairs,Poetter Parshall,Samantha,Ms,,M. ,Samantha Poetter Parshall,S,M,P,"Poetter Parshall, Samantha",,Poetter Parshall,,,,,,,,,Miami,6,samantha.poetter@house.ks.gov,,Name changed to Poetter Parshall by request of Representative on 1/13/2022,,samantha@samanthaforkansas.com,,20355 W. 299th St.,,Paola,KS,66071,913 731-6602,20355 W. 299th St.,,Paola,KS,66071,,,,,,,166-W,785 296-7748,,,Republican,,Samantha,81,Dakotah Parshall,,,,
Representative,KS,ctte_h_fed_st_1,Federal and State Affairs,Resman,John,,,,John Resman,J,,R,"Resman, John",,,,,,,,,,,Johnson,121,john.resman@house.ks.gov,,Sworn 2/16/17 to replace Rep. Kiegerl,,resmandist121@gmail.com,,434 North Persimmon Drive,,Olathe,KS,66061,913-709-4246,  434 North Persimmon Drive,,Olathe,KS,66061,Retired Deputy Sheriff,,,,,,559-W,785-296-7636,,,Republican,,,97,Elizabeth,,,,
Representative,KS,ctte_h_fed_st_1,Federal and State Affairs,Ruiz,Louis,Mr,,,Louis Ruiz,L,E,R,"Ruiz, Louis",,Ruiz,,,,louis_ruiz@sbcglobal.net,,785-296-7122,,,Wyandotte,31,louis.ruiz@house.ks.gov,,,2005,louis_ruiz@sbcglobal.net,,2914 West 46th Avenue,,Kansas City,KS,66103,913-262-1634,2914 West 46th Avenue,,Kansas City,KS,66103,Retired; Lucent,,,,,,47-S,785 296-7885,,,Democrat,,Louis,18,Marthel Parsons-Ruiz,,,,Yes
Representative,KS,ctte_h_fed_st_1,Federal and State Affairs,Smith,Eric,Mr,,L. ,Eric Smith,E,L,S,"Smith, Eric",,Smith,,,,esmith@coffeycountyks.org,,,,,Coffey,76,Eric.Smith@house.ks.gov,,,,,,627 Kennebec Street,,Burlington ,KS,66839,620-490-1458,627 Kennebec Street,,Burlington ,KS,66839,Deputy Sheriff,,,,,,512-N,785 296-7557,,,Republican,,Eric,120,Becky,,,,
Representative,KS,ctte_h_fed_st_1,Federal and State Affairs,Thomas,Adam,Mr,,,Adam Thomas,A,,T,"Thomas, Adam",,Thomas,,,,,,,,,Johnson,26,Adam.Thomas@house.ks.gov,,,,adamt.thomas@yahoo.com,,16272 S. Sunset St.,,Olathe,KS,66062,615 624-2991,16272 S. Sunset St.,,Olathe,KS,66062,Restaurant Owner,,,,,,268-W,785-296-3113,,,Republican,,Adam,46,Kristin,,,,
Representative,KS,ctte_h_fed_st_1,Federal and State Affairs,Waggoner,Paul,Mr,,,Paul Waggoner,P,,W,"Waggoner, Paul",,Waggoner,,,,pwaggoner@pewcushions.com,,620-662-0181,,,Reno,104,Paul.Waggoner@house.ks.gov,,,,waggonerforkansas@gmail.com,,600 E. 73rd,,Hutchinson,KS,67502,620-665-6067,600 E. 73rd,,Hutchinson,KS,67502,"Manager, Waggoners, Inc.",,,,,,519-N,785 296-7196,,,Republican,,Paul,90,Debra Waggoner,,,,
